Target
3-hydroxy-3-methylglutaryl-coenzyme A reductase
Ligand
BDBM50003237
Substrate
Meas. Tech.
ChEBML_78487
IC50
7.6±n/a nM
Citation
 Hartman, GDHalczenko, WDuggan, MEImagire, JSSmith, RLPitzenberger, SMFitzpatrick, SLAlberts, AWBostedor, RChao, YS 3-Hydroxy-3-methylglutaryl-coenzyme A reductase inhibitors. 9. The synthesis and biological evaluation of novel simvastatin analogs. J Med Chem 35:3813-21 (1992)  
Target
Name:
3-hydroxy-3-methylglutaryl-coenzyme A reductase
Synonyms:
3-hydroxy-3-methylglutaryl-coenzyme A (HMG-CoA) reductase HMDH_HUMAN HMG-CoA reductase (HMGR) | HMGCR
Type:
Enzyme
Mol. Mass.:
97477.10
Organism:
Homo sapiens (Human)
Description:
P04035
Residue:
888
  
Inhibitor
Name:
BDBM50003237
Synonyms:
2,2-Dimethyl-butyric acid 2-(1-hydroxy-ethyl)-8-[2-(4-hydroxy-6-oxo-tetrahydro-pyran-2-yl)-ethyl]-3,7-dimethyl-1,2,3,7,8,8a-hexahydro-naphthalen-1-yl ester | CHEMBL3349827
Type:
Small organic molecule
Emp. Form.:
C27H42O6
Mol. Mass.:
462.6188
SMILES:
[H][C@@](C)(O)[C@]1([H])[C@@H](C)C=C2C=C[C@H](C)[C@H](CC[C@@H]3C[C@@H](O)CC(=O)O3)C2[C@H]1OC(=O)C(C)(C)CC
: