Target
Type-1 angiotensin II receptor B
Ligand
BDBM50003292
Substrate
Meas. Tech.
ChEBML_34812
IC50
90±n/a nM
Citation
 Keenan, RMWeinstock, JFinkelstein, JAFranz, RGGaitanopoulos, DEGirard, GRHill, DTMorgan, TMSamanen, JMHempel, J Imidazole-5-acrylic acids: potent nonpeptide angiotensin II receptor antagonists designed using a novel peptide pharmacophore model. J Med Chem 35:3858-72 (1992)  
Target
Name:
Type-1 angiotensin II receptor B
Synonyms:
AGTRB_RAT Agtr1 Angiotensin II AT1B Angiotensin II type 1b (AT-1b) receptor Type-1B angiotensin II receptor
Type:
Enzyme Catalytic Domain
Mol. Mass.:
40929.44
Organism:
RAT
Description:
Angiotensin II AT1B 0 RAT::P29089
Residue:
359
  
Inhibitor
Name:
BDBM50003292
Synonyms:
3-[2-Butyl-3-(2-chloro-benzyl)-3H-imidazol-4-yl]-2-(5-methoxy-thiophen-2-ylmethyl)-acrylic acid | CHEMBL127194
Type:
Small organic molecule
Emp. Form.:
C23H25ClN2O3S
Mol. Mass.:
444.974
SMILES:
CCCCc1ncc(\C=C(/Cc2ccc(OC)s2)C(O)=O)n1Cc1ccccc1Cl
: