Target
Polyunsaturated fatty acid 5-lipoxygenase
Ligand
BDBM50003427
Substrate
Meas. Tech.
ChEBML_3958
IC50
2600±n/a nM
Citation
 Wright, SWHarris, RRKerr, JSGreen, AMPinto, DJBruin, EMCollins, RJDorow, RLMantegna, LRSherk, SR Synthesis, chemical, and biological properties of vinylogous hydroxamic acids: dual inhibitors of 5-lipoxygenase and IL-1 biosynthesis. J Med Chem 35:4061-8 (1992)  
Target
Name:
Polyunsaturated fatty acid 5-lipoxygenase
Synonyms:
Alox5 LOX5_RAT
Type:
PROTEIN
Mol. Mass.:
78082.31
Organism:
Rattus norvegicus
Description:
ChEMBL_1432947
Residue:
673
  
Inhibitor
Name:
BDBM50003427
Synonyms:
3-[(4-Benzyloxy-benzyl)-hydroxy-amino]-1-cyclopropyl-propenone | CHEMBL131595
Type:
Small organic molecule
Emp. Form.:
C20H21NO3
Mol. Mass.:
323.3856
SMILES:
ON(Cc1ccc(OCc2ccccc2)cc1)C=CC(=O)C1CC1
: