Target
Polyunsaturated fatty acid 5-lipoxygenase
Ligand
BDBM50003454
Substrate
Meas. Tech.
ChEBML_3958
IC50
>25000±n/a nM
Citation
 Wright, SWHarris, RRKerr, JSGreen, AMPinto, DJBruin, EMCollins, RJDorow, RLMantegna, LRSherk, SR Synthesis, chemical, and biological properties of vinylogous hydroxamic acids: dual inhibitors of 5-lipoxygenase and IL-1 biosynthesis. J Med Chem 35:4061-8 (1992)  
Target
Name:
Polyunsaturated fatty acid 5-lipoxygenase
Synonyms:
Alox5 LOX5_RAT
Type:
PROTEIN
Mol. Mass.:
78082.31
Organism:
Rattus norvegicus
Description:
ChEMBL_1432947
Residue:
673
  
Inhibitor
Name:
BDBM50003454
Synonyms:
CHEMBL130800 | N-Acetoxy-3-methylamino-1-(4-nitro-phenyl)-propenone
Type:
Small organic molecule
Emp. Form.:
C12H12N2O5
Mol. Mass.:
264.2341
SMILES:
CC(=O)O[N+](C)=C[CH-]C(=O)c1ccc(cc1)[N+]([O-])=O
: