Target
Polyunsaturated fatty acid 5-lipoxygenase
Ligand
BDBM50003417
Substrate
Meas. Tech.
ChEBML_3958
IC50
610±n/a nM
Citation
 Wright, SWHarris, RRKerr, JSGreen, AMPinto, DJBruin, EMCollins, RJDorow, RLMantegna, LRSherk, SR Synthesis, chemical, and biological properties of vinylogous hydroxamic acids: dual inhibitors of 5-lipoxygenase and IL-1 biosynthesis. J Med Chem 35:4061-8 (1992)  
Target
Name:
Polyunsaturated fatty acid 5-lipoxygenase
Synonyms:
Alox5 LOX5_RAT
Type:
PROTEIN
Mol. Mass.:
78082.31
Organism:
Rattus norvegicus
Description:
ChEMBL_1432947
Residue:
673
  
Inhibitor
Name:
BDBM50003417
Synonyms:
3-(Benzyl-hydroxy-amino)-1-(3,4-dichloro-phenyl)-propenone | CHEMBL336285
Type:
Small organic molecule
Emp. Form.:
C16H13Cl2NO2
Mol. Mass.:
322.186
SMILES:
ON(Cc1ccccc1)\C=C/C(=O)c1ccc(Cl)c(Cl)c1
: