Target
Polyunsaturated fatty acid 5-lipoxygenase
Ligand
BDBM50003414
Substrate
Meas. Tech.
ChEBML_3958
IC50
2600±n/a nM
Citation
 Wright, SWHarris, RRKerr, JSGreen, AMPinto, DJBruin, EMCollins, RJDorow, RLMantegna, LRSherk, SR Synthesis, chemical, and biological properties of vinylogous hydroxamic acids: dual inhibitors of 5-lipoxygenase and IL-1 biosynthesis. J Med Chem 35:4061-8 (1992)  
Target
Name:
Polyunsaturated fatty acid 5-lipoxygenase
Synonyms:
Alox5 LOX5_RAT
Type:
PROTEIN
Mol. Mass.:
78082.31
Organism:
Rattus norvegicus
Description:
ChEMBL_1432947
Residue:
673
  
Inhibitor
Name:
BDBM50003414
Synonyms:
3-(Cyclohexyl-hydroxy-amino)-1-naphthalen-2-yl-propenone | CHEMBL130783
Type:
Small organic molecule
Emp. Form.:
C19H21NO2
Mol. Mass.:
295.3755
SMILES:
ON(\C=C/C(=O)c1ccc2ccccc2c1)C1CCCCC1
: