Target
Polyunsaturated fatty acid 5-lipoxygenase
Ligand
BDBM50003460
Substrate
Meas. Tech.
ChEBML_3958
IC50
>25000±n/a nM
Citation
 Wright, SWHarris, RRKerr, JSGreen, AMPinto, DJBruin, EMCollins, RJDorow, RLMantegna, LRSherk, SR Synthesis, chemical, and biological properties of vinylogous hydroxamic acids: dual inhibitors of 5-lipoxygenase and IL-1 biosynthesis. J Med Chem 35:4061-8 (1992)  
Target
Name:
Polyunsaturated fatty acid 5-lipoxygenase
Synonyms:
Alox5 LOX5_RAT
Type:
PROTEIN
Mol. Mass.:
78082.31
Organism:
Rattus norvegicus
Description:
ChEMBL_1432947
Residue:
673
  
Inhibitor
Name:
BDBM50003460
Synonyms:
3-Benzyloxyamino-1-(4-fluoro-phenyl)-propenone | CHEMBL131279
Type:
Small organic molecule
Emp. Form.:
C16H14FNO2
Mol. Mass.:
271.2863
SMILES:
Fc1ccc(cc1)C(=O)CC=NOCc1ccccc1
: