Target
Amine oxidase [flavin-containing] B
Ligand
BDBM50003596
Substrate
Meas. Tech.
ChEMBL_123610 (CHEMBL734190)
Ki
268000±n/a nM
Citation
 Kalgutkar, ASCastagnoli, N Synthesis of novel MPTP analogs as potential monoamine oxidase B (MAO-B) inhibitors. J Med Chem 35:4165-74 (1992)  
Target
Name:
Amine oxidase [flavin-containing] B
Synonyms:
AOFB_BOVIN MAO-B Monoamine Oxidase Type B (MAO-B) Monoamine oxidase B | Monoamine oxidase type B
Type:
PROTEIN
Mol. Mass.:
58428.94
Organism:
Bos taurus
Description:
ChEMBL_1501478
Residue:
520
  
Inhibitor
Name:
BDBM50003596
Synonyms:
1-Allyl-4-phenyl-1,2,3,6-tetrahydro-pyridine CHEMBL100177
Type:
Small organic molecule
Emp. Form.:
C14H17N
Mol. Mass.:
199.2915
SMILES:
C=CCN1CCC(=CC1)c1ccccc1
: