Target
Induced myeloid leukemia cell differentiation protein Mcl-1
Ligand
BDBM50244152
Substrate
Meas. Tech.
ChEMBL_1673169 (CHEMBL4023198)
Ki
0.460000±n/a nM
Citation
 Shaw, SBian, ZZhao, BTarr, JCVeerasamy, NJeon, KOBelmar, JArnold, ALFogarty, SAPerry, ESensintaffar, JLCamper, DVRossanese, OWLee, TOlejniczak, ETFesik, SW Optimization of Potent and Selective Tricyclic Indole Diazepinone Myeloid Cell Leukemia-1 Inhibitors Using Structure-Based Design. J Med Chem 61:2410-2421 (2018)  
Target
Name:
Induced myeloid leukemia cell differentiation protein Mcl-1
Synonyms:
BCL2L3 Bcl-2-like protein 3 (Mcl-1) Bcl2-L-3 MCL1 Mcl-1 Myeloid cell leukemia sequence 1 (BCL2-related) | mcl1/EAT
Type:
Membrane; Single-pass membrane protein
Mol. Mass.:
37332.87
Organism:
Homo sapiens (Human)
Description:
Q07820
Residue:
350
  
Inhibitor
Name:
BDBM50244152
Synonyms:
CHEMBL4061061 | US11596639, Example 74
Type:
Small organic molecule
Emp. Form.:
C39H39Cl2N5O4
Mol. Mass.:
712.664
SMILES:
Cc1nn(C)c(C)c1-c1c(Cl)ccc2c(CCCOc3cc(C)c(Cl)c(C)c3)c3C(=O)N(CCCn3c12)c1cn(C)c2c(cccc12)C(O)=O
: