Target
Induced myeloid leukemia cell differentiation protein Mcl-1
Ligand
BDBM50244170
Substrate
Meas. Tech.
ChEMBL_1673166 (CHEMBL4023195)
Ki
<1.000000±n/a nM
Citation
 Shaw, SBian, ZZhao, BTarr, JCVeerasamy, NJeon, KOBelmar, JArnold, ALFogarty, SAPerry, ESensintaffar, JLCamper, DVRossanese, OWLee, TOlejniczak, ETFesik, SW Optimization of Potent and Selective Tricyclic Indole Diazepinone Myeloid Cell Leukemia-1 Inhibitors Using Structure-Based Design. J Med Chem 61:2410-2421 (2018)  
Target
Name:
Induced myeloid leukemia cell differentiation protein Mcl-1
Synonyms:
BCL2L3 Bcl-2-like protein 3 (Mcl-1) Bcl2-L-3 MCL1 Mcl-1 Myeloid cell leukemia sequence 1 (BCL2-related) | mcl1/EAT
Type:
Membrane; Single-pass membrane protein
Mol. Mass.:
37332.87
Organism:
Homo sapiens (Human)
Description:
Q07820
Residue:
350
  
Inhibitor
Name:
BDBM50244170
Synonyms:
CHEMBL4082941 US11208415, Example I-351
Type:
Small organic molecule
Emp. Form.:
C40H38Cl2N4O4
Mol. Mass.:
709.66
SMILES:
Cc1nn(C)c(C)c1-c1c(Cl)ccc2c(CCCOc3cc(C)c(Cl)c(C)c3)c3C(=O)N(CCCn3c12)c1cccc2c(cccc12)C(O)=O
: