Target
Chymotrypsinogen A
Ligand
BDBM50003737
Substrate
Meas. Tech.
ChEBML_216784
Ki
170±n/a nM
Citation
 Rai, RKatzenellenbogen, JA Effect of conformational mobility and hydrogen-bonding interactions on the selectivity of some guanidinoaryl-substituted mechanism-based inhibitors of trypsin-like serine proteases. J Med Chem 35:4297-305 (1992)  
Target
Name:
Chymotrypsinogen A
Synonyms:
Alpha-chymotrypsin Chymotrypsin A Chymotrypsin A chain B Chymotrypsinogen A | alpha-Chymotrypsin (α-Chymotrypsin)
Type:
Serine protease
Mol. Mass.:
25670.88
Organism:
Bos taurus (bovine)
Description:
Residue:
245
  
Inhibitor
Name:
BDBM50003737
Synonyms:
(Lactone4)N-[4-(4-Guanidino-phenyl)-6-iodomethylene-2-oxo-tetrahydro-pyran-3-yl]-benzamide | CHEMBL135724
Type:
Small organic molecule
Emp. Form.:
C20H19IN4O3
Mol. Mass.:
490.2943
SMILES:
[#7]\[#6](-[#7])=[#7]\c1ccc(cc1)-[#6]-1-[#6]\[#6](-[#8]-[#6](=O)-[#6]-1-[#7]-[#6](=O)-c1ccccc1)=[#6]\I
: