Target
Metabotropic glutamate receptor 2
Ligand
BDBM50244202
Substrate
Meas. Tech.
ChEMBL_1673188 (CHEMBL4023217)
Ki
32±n/a nM
Citation
 Monn, JAHenry, SSMassey, SMClawson, DKChen, QDiseroad, BABhardwaj, RMAtwell, SLu, FWang, JRussell, MHeinz, BAWang, XSCarter, JHGetman, BGAdragni, KBroad, LMSanger, HEUrsu, DCatlow, JTSwanson, SJohnson, BGShaw, DBMcKinzie, DLHao, J Synthesis and Pharmacological Characterization of C4 J Med Chem 61:2303-2328 (2018)  
Target
Name:
Metabotropic glutamate receptor 2
Synonyms:
GPRC1B GRM2_HUMAN Metabotropic glutamate receptor mGlu2 | metabotropic glutamate 2
Type:
Enzyme
Mol. Mass.:
95584.88
Organism:
Homo sapiens (Human)
Description:
Q14416
Residue:
872
  
Inhibitor
Name:
BDBM50244202
Synonyms:
CHEMBL4091735
Type:
Small organic molecule
Emp. Form.:
C15H16N2O6
Mol. Mass.:
320.2973
SMILES:
[H][C@]12[C@H](C(O)=O)[C@@]1([H])[C@@](N)(C[C@@H]2NC(=O)c1cccc(O)c1)C(O)=O
: