Target
Metabotropic glutamate receptor 3
Ligand
BDBM50434137
Substrate
Meas. Tech.
ChEMBL_1673189 (CHEMBL4023218)
Ki
177±n/a nM
Citation
 Monn, JAHenry, SSMassey, SMClawson, DKChen, QDiseroad, BABhardwaj, RMAtwell, SLu, FWang, JRussell, MHeinz, BAWang, XSCarter, JHGetman, BGAdragni, KBroad, LMSanger, HEUrsu, DCatlow, JTSwanson, SJohnson, BGShaw, DBMcKinzie, DLHao, J Synthesis and Pharmacological Characterization of C4 J Med Chem 61:2303-2328 (2018)  
Target
Name:
Metabotropic glutamate receptor 3
Synonyms:
GPRC1C GRM3_HUMAN metabotropic glutamate 3 metabotropic glutamate 3/1c
Type:
Enzyme Catalytic Domain
Mol. Mass.:
98889.09
Organism:
Homo sapiens (Human)
Description:
metabotropic glutamate 1c 0 HUMAN::Q14832
Residue:
879
  
Inhibitor
Name:
BDBM50434137
Synonyms:
CHEMBL2381649
Type:
Small organic molecule
Emp. Form.:
C10H14N2O5
Mol. Mass.:
242.2286
SMILES:
CC(=O)N[C@H]1C[C@](N)([C@H]2[C@@H]1[C@@H]2C(O)=O)C(O)=O
: