Target
Acetylcholinesterase
Ligand
BDBM50244245
Substrate
Meas. Tech.
ChEMBL_1673532 (CHEMBL4023561)
IC50
19953±n/a nM
Citation
 Dolles, DHoffmann, MGunesch, SMarinelli, OMöller, JSantoni, GChatonnet, ALohse, MJWittmann, HJStrasser, ANabissi, MMaurice, TDecker, M Structure-Activity Relationships and Computational Investigations into the Development of Potent and Balanced Dual-Acting Butyrylcholinesterase Inhibitors and Human Cannabinoid Receptor 2 Ligands with Pro-Cognitive in Vivo Profiles. J Med Chem 61:1646-1663 (2018)  
Target
Name:
Acetylcholinesterase
Synonyms:
ACES_HUMAN Acetylcholinesterase (AChE) | Acetylcholinesterase (human AChE)
Type:
Enzyme
Mol. Mass.:
67792.70
Organism:
Homo sapiens (Human)
Description:
P22303
Residue:
614
  
Inhibitor
Name:
BDBM50244245
Synonyms:
CHEMBL4082785
Type:
Small organic molecule
Emp. Form.:
C32H46N4O2
Mol. Mass.:
518.7332
SMILES:
CCOc1ccc(Cc2nc3cc(ccc3n2CCCCCCN2CCCCC2)C(=O)N(CC)CC)cc1
: