Target
Tyrosine-protein kinase BTK
Ligand
BDBM50244493
Substrate
Meas. Tech.
ChEMBL_1673668 (CHEMBL4023697)
Ki
0.800000±n/a nM
Citation
 Crawford, JJJohnson, ARMisner, DLBelmont, LDCastanedo, GChoy, RCoraggio, MDong, LEigenbrot, CErickson, RGhilardi, NHau, JKatewa, AKohli, PBLee, WLubach, JWMcKenzie, BSOrtwine, DFSchutt, LTay, SWei, BReif, KLiu, LWong, HYoung, WB Discovery of GDC-0853: A Potent, Selective, and Noncovalent Bruton's Tyrosine Kinase Inhibitor in Early Clinical Development. J Med Chem 61:2227-2245 (2018)  
Target
Name:
Tyrosine-protein kinase BTK
Synonyms:
AGMX1 Agammaglobulinaemia tyrosine kinase B cell progenitor kinase BPK BTK_HUMAN Tyrosine Kinase BTK Tyrosine-protein kinase BTK (BTK)
Type:
Enzyme
Mol. Mass.:
76289.95
Organism:
Homo sapiens (Human)
Description:
Q06187
Residue:
659
  
Inhibitor
Name:
BDBM50244493
Synonyms:
CHEMBL4070991
Type:
Small organic molecule
Emp. Form.:
C36H43N9O4
Mol. Mass.:
665.7845
SMILES:
C[C@H]1CN(CCN1c1cnc(Nc2cc(cn(C)c2=O)-c2ccnc(N3CCn4c5CC(C)(C)Cc5cc4C3=O)c2CO)cn1)C1COC1
: