Target
Cyclin-T1/Cyclin-dependent kinase 9
Ligand
BDBM148264
Substrate
Meas. Tech.
ChEMBL_1674268 (CHEMBL4024297)
IC50
197±n/a nM
Citation
 Li, YLuo, XGuo, QNie, YWang, TZhang, CHuang, ZWang, XLiu, YChen, YZheng, JYang, SFan, YXiang, R Discovery of N1-(4-((7-Cyclopentyl-6-(dimethylcarbamoyl)-7 H-pyrrolo[2,3- d]pyrimidin-2-yl)amino)phenyl)- N8-hydroxyoctanediamide as a Novel Inhibitor Targeting Cyclin-dependent Kinase 4/9 (CDK4/9) and Histone Deacetlyase1 (HDAC1) against Malignant Cancer. J Med Chem 61:3166-3192 (2018)  
Target
Name:
Cyclin-T1/Cyclin-dependent kinase 9
Synonyms:
CDK9/ Cyclin-T1 CDK9/Cyclin T Cyclin T1/dependent kinase 9 | Cyclin-Dependent Kinase 9 (CDK9)
Type:
Protein Complex
Mol. Mass.:
Description:
Components:
This complex has 2 components.
Component 1
Name:
Cyclin-T1
Synonyms:
CCNT1 CycT Cyclin T Cyclin-T
Type:
Enzyme Subunit
Mol. Mass.:
80712.40
Organism:
Homo sapiens (Human)
Description:
Residue:
726
  
Component 2
Name:
Cyclin-dependent kinase 9
Synonyms:
C-2K CDK9 Cell division cycle 2-like protein kinase 4 Cyclin-Dependent Kinase 9 (CDK9) Serine/threonine-protein kinase PITALRE Tat-associated kinase complex catalytic subunit
Type:
Enzyme Subunit
Mol. Mass.:
42789.13
Organism:
Homo sapiens (Human)
Description:
Residue:
372
  
Inhibitor
Name:
BDBM148264
Synonyms:
7-cyclopentyl-N,N-dimethyl-2-((5-(piperazin-1-yl)pyridin-2-yl)amino)-7H-pyrrolo[2,3-d]pyrimidine-6-carboxamide LEE011 US10570141, Comparative Example 1 | US8962630, 74
Type:
Small organic molecule
Emp. Form.:
C23H30N8O
Mol. Mass.:
434.5373
SMILES:
CN(C)C(=O)c1cc2cnc(Nc3ccc(cn3)N3CCNCC3)nc2n1C1CCCC1
: