Target
Acetylcholinesterase
Ligand
BDBM50004014
Substrate
Meas. Tech.
ChEBML_28911
IC50
270±n/a nM
Citation
 Sugimoto, HTsuchiya, YSugumi, HHigurashi, KKaribe, NIimura, YSasaki, AAraki, SYamanishi, YYamatsu, K Synthesis and structure-activity relationships of acetylcholinesterase inhibitors: 1-benzyl-4-(2-phthalimidoethyl)piperidine and related derivatives. J Med Chem 35:4542-8 (1993)  
Target
Name:
Acetylcholinesterase
Synonyms:
ACES_MOUSE Acetylcholinesterase (mouse AChE) Ache
Type:
Enzyme
Mol. Mass.:
68165.65
Organism:
Mus musculus (mouse)
Description:
Residue:
614
  
Inhibitor
Name:
BDBM50004014
Synonyms:
1-(2-(1-benzylpiperidin-4-yl)ethyl)piperidin-2-one CHEMBL141515
Type:
Small organic molecule
Emp. Form.:
C19H28N2O
Mol. Mass.:
300.4384
SMILES:
O=C1CCCCN1CCC1CCN(Cc2ccccc2)CC1
: