Target
Acetylcholinesterase
Ligand
BDBM50004033
Substrate
Meas. Tech.
ChEBML_28911
IC50
13±n/a nM
Citation
 Sugimoto, HTsuchiya, YSugumi, HHigurashi, KKaribe, NIimura, YSasaki, AAraki, SYamanishi, YYamatsu, K Synthesis and structure-activity relationships of acetylcholinesterase inhibitors: 1-benzyl-4-(2-phthalimidoethyl)piperidine and related derivatives. J Med Chem 35:4542-8 (1993)  
Target
Name:
Acetylcholinesterase
Synonyms:
ACES_MOUSE Acetylcholinesterase (mouse AChE) Ache
Type:
Enzyme
Mol. Mass.:
68165.65
Organism:
Mus musculus (mouse)
Description:
Residue:
614
  
Inhibitor
Name:
BDBM50004033
Synonyms:
3-(2-(1-benzylpiperidin-4-yl)ethyl)-3,4-dihydroquinazolin-2(1H)-one CHEMBL141276
Type:
Small organic molecule
Emp. Form.:
C22H27N3O
Mol. Mass.:
349.4693
SMILES:
O=C1Nc2ccccc2CN1CCC1CCN(Cc2ccccc2)CC1
: