Target
Adenosine receptor A2a/A2b
Ligand
BDBM50421976
Substrate
Meas. Tech.
ChEBML_27637
EC50
3.5±n/a nM
Citation
 Niiya, KOlsson, RAThompson, RDSilvia, SKUeeda, M 2-(N'-alkylidenehydrazino)adenosines: potent and selective coronary vasodilators. J Med Chem 35:4557-61 (1993)  
Target
Name:
Adenosine receptor A2a/A2b
Synonyms:
Adenosine A2 receptor
Type:
Mol. Mass.:
Description:
ASSAY_ID of ChEMBL is 329906
Components:
This complex has 2 components.
Component 1
Name:
Adenosine receptor A2b
Synonyms:
AA2BR_HUMAN ADORA2B Adenosine receptors A2b | Adenosine receptors; A2a & A2b
Type:
G Protein-Coupled Receptor (GPCR)
Mol. Mass.:
36341.22
Organism:
Homo sapiens (Human)
Description:
Residue:
332
  
Component 2
Name:
Adenosine receptor A2a
Synonyms:
A2A adenosine receptor (hA2A) ADENOSINE A2 ADORA2 Adenosine A2A receptor (A2AAR)
Type:
G Protein-Coupled Receptor (GPCR)
Mol. Mass.:
44716.46
Organism:
Homo sapiens (Human)
Description:
P29274
Residue:
412
  
Inhibitor
Name:
BDBM50421976
Synonyms:
CHEMBL607796
Type:
Small organic molecule
Emp. Form.:
C17H23N7O4
Mol. Mass.:
389.409
SMILES:
Nc1nc(N=NCC2=CCCCC2)nc2n(cnc12)C1O[C@H](CO)[C@@H](O)[C@H]1O
: