Target
Leucyl-cystinyl aminopeptidase
Ligand
BDBM50076744
Substrate
Meas. Tech.
ChEMBL_1674664 (CHEMBL4024807)
IC50
57±n/a nM
Citation
 Kokkala, PMpakali, AMauvais, FXPapakyriakou, ADaskalaki, IPetropoulou, IKavvalou, SPapathanasopoulou, MAgrotis, SFonsou, TMvan Endert, PStratikos, EGeorgiadis, D Optimization and Structure-Activity Relationships of Phosphinic Pseudotripeptide Inhibitors of Aminopeptidases That Generate Antigenic Peptides. J Med Chem 59:9107-9123 (2016)  
Target
Name:
Leucyl-cystinyl aminopeptidase
Synonyms:
Aminopeptidase Cystinyl aminopeptidase Insulin-regulated membrane aminopeptidase LCAP_HUMAN Leucyl-cystinyl aminopeptidase, pregnancy serum form Oxytocinase Placental leucine aminopeptidase
Type:
PROTEIN
Mol. Mass.:
117334.10
Organism:
Homo sapiens (Human)
Description:
ChEMBL_1473494
Residue:
1025
  
Inhibitor
Name:
BDBM50076744
Synonyms:
CHEMBL3416733
Type:
Small organic molecule
Emp. Form.:
C27H37N4O4P
Mol. Mass.:
512.5808
SMILES:
CC(C)C[C@H](CP(O)(=O)[C@@H](N)CCc1ccccc1)C(=O)N[C@@H](Cc1c[nH]c2ccccc12)C(N)=O
: