Target
Glutamate receptor ionotropic, NMDA 1
Ligand
BDBM83449
Substrate
Meas. Tech.
ChEBML_154064
Ki
65±n/a nM
Citation
 de Costa, BRMattson, MVGeorge, CLinders, JT Synthesis, configuration, and activity of isomeric 2-phenyl-2-(N-piperidinyl)bicyclo[3.1.0]hexanes at phencyclidine and sigma binding sites. J Med Chem 35:4704-12 (1993)  
Target
Name:
Glutamate receptor ionotropic, NMDA 1
Synonyms:
Glutamate (NMDA) receptor subunit zeta 1 Glutamate-NMDA-Channel Glutamate-NMDA-Polyamine NMDA Nmdar1 | phencyclidine
Type:
Enzyme Catalytic Domain
Mol. Mass.:
105533.40
Organism:
RAT
Description:
P35439
Residue:
938
  
Inhibitor
Name:
BDBM83449
Synonyms:
1-(1-phenylcyclohexyl)piperidine;hydrochloride PCP PHENCYCLIDINE SMR001338811 | cid_9795678
Type:
Small organic molecule
Emp. Form.:
C17H25N
Mol. Mass.:
243.3871
SMILES:
C1CCN(CC1)C1(CCCCC1)c1ccccc1
: