Target
Cholecystokinin receptor type A
Ligand
BDBM50004439
Substrate
Meas. Tech.
ChEBML_49569
EC50
1.4±n/a nM
Citation
 Ron, DGilon, CHanani, MVromen, ASelinger, ZChorev, M N-methylated analogs of Ac[Nle28,31]CCK(26-33): synthesis, activity, and receptor selectivity. J Med Chem 35:2806-11 (1992)  
Target
Name:
Cholecystokinin receptor type A
Synonyms:
CCK-A receptor CCK1-R CCKAR_CAVPO Cholecystokinin receptor type A | Cholecystokinin-1 receptor
Type:
Mol. Mass.:
48229.77
Organism:
Cavia porcellus
Description:
Residue:
430
  
Inhibitor
Name:
BDBM50004439
Synonyms:
3-Acetylamino-N-[1-[1-({[1-{1-[1-(1-carbamoyl-2-phenyl-ethylcarbamoyl)-2-carboxy-ethylcarbamoyl]-pentylcarbamoyl}-2-(1H-indol-3-yl)-ethylcarbamoyl]-methyl}-carbamoyl)-pentylcarbamoyl]-2-(4-sulfooxy-phenyl)-ethyl]-N-methyl-succinamic acid | CHEMBL414592
Type:
Small organic molecule
Emp. Form.:
C54H70N10O17S
Mol. Mass.:
1163.255
SMILES:
CCCC[C@H](NC(=O)[C@H](Cc1ccc(OS(O)(=O)=O)cc1)N(C)C(=O)[C@H](CC(O)=O)NC(C)=O)C(=O)NCC(=O)N[C@@H](Cc1c[nH]c2ccccc12)C(=O)N[C@@H](CCCC)C(=O)N[C@@H](CC(O)=O)C(=O)N[C@@H](Cc1ccccc1)C(N)=O
: