Target
Cytochrome P450 2A2
Ligand
BDBM31768
Substrate
Meas. Tech.
ChEBML_17
IC50
369±n/a nM
Citation
 Rotstein, DMKertesz, DJWalker, KASwinney, DC Stereoisomers of ketoconazole: preparation and biological activity. J Med Chem 35:2818-25 (1992)  
Target
Name:
Cytochrome P450 2A2
Synonyms:
CP2A2_RAT Cyp2a2
Type:
PROTEIN
Mol. Mass.:
56350.84
Organism:
Rattus norvegicus
Description:
ChEMBL_17
Residue:
492
  
Inhibitor
Name:
BDBM31768
Synonyms:
CHEMBL295698 Nizoral | Panfungol
Type:
Small organic molecule
Emp. Form.:
C26H28Cl2N4O4
Mol. Mass.:
531.431
SMILES:
CC(=O)N1CCN(CC1)c1ccc(OC[C@@H]2CO[C@](Cn3ccnc3)(O2)c2ccc(Cl)cc2Cl)cc1
: