Target
Cytochrome P450 2D6
Ligand
BDBM50246760
Substrate
Meas. Tech.
ChEMBL_1676809 (CHEMBL4026952)
EC50
>100000±n/a nM
Citation
 Van der Plas, SEKelgtermans, HDe Munck, TMartina, SLXDropsit, SQuinton, EDe Blieck, AJoannesse, CTomaskovic, LJans, MChristophe, Tvan der Aar, EBorgonovi, MNelles, LGees, MStouten, PVan Der Schueren, JMammoliti, OConrath, KAndrews, M Discovery of N-(3-Carbamoyl-5,5,7,7-tetramethyl-5,7-dihydro-4H-thieno[2,3-c]pyran-2-yl)-lH-pyrazole-5-carboxamide (GLPG1837), a Novel Potentiator Which Can Open Class III Mutant Cystic Fibrosis Transmembrane Conductance Regulator (CFTR) Channels to a High Extent. J Med Chem 61:1425-1435 (2018)  
Target
Name:
Cytochrome P450 2D6
Synonyms:
CP2D6_HUMAN CYP2DL1 Cytochrome P450 2D6 (CYP2D6) P450-DB1
Type:
Protein
Mol. Mass.:
55774.82
Organism:
Homo sapiens (Human)
Description:
P10635
Residue:
497
  
Inhibitor
Name:
BDBM50246760
Synonyms:
CHEMBL4075348
Type:
Small organic molecule
Emp. Form.:
C16H20N4O3S
Mol. Mass.:
348.42
SMILES:
CC1(C)Cc2c(sc(NC(=O)c3ccn[nH]3)c2C(N)=O)C(C)(C)O1
: