Target
Cholecystokinin receptor type A/Gastrin/cholecystokinin type B receptor
Ligand
BDBM50004477
Substrate
Meas. Tech.
ChEMBL_70835 (CHEMBL680199)
EC50
0.100000±n/a nM
Citation
 Holladay, MWBennett, MJTufano, MDLin, CWAsin, KEWitte, DGMiller, TRBianchi, BRNikkel, ALBednarz, L Synthesis and biological activity of CCK heptapeptide analogues. Effects of conformational constraints and standard modifications on receptor subtype selectivity, functional activity in vitro, and appetite suppression in vivo. J Med Chem 35:2919-28 (1992)  
Target
Name:
Cholecystokinin receptor type A/Gastrin/cholecystokinin type B receptor
Synonyms:
Cholecystokinin receptor
Type:
Mol. Mass.:
Description:
ASSAY_ID of ChEMBL is 357790
Components:
This complex has 2 components.
Component 1
Name:
Cholecystokinin receptor type A
Synonyms:
CCK-A receptor CCK1-R CCKAR_HUMAN Cholecystokinin receptor Cholecystokinin-1 Receptor
Type:
G Protein-Coupled Receptor (GPCR)
Mol. Mass.:
47859.34
Organism:
Homo sapiens (Human)
Description:
Stable expression of human CCK-1 receptors in HEK 293 cells.
Residue:
428
  
Component 2
Name:
Gastrin/cholecystokinin type B receptor
Synonyms:
CCK-2 receptor CCK-BR CCKRB Cholecystokinin receptor GASR_HUMAN | Gastrin/cholecystokinin type B receptor
Type:
G Protein-Coupled Receptor (GPCR)
Mol. Mass.:
48445.79
Organism:
Homo sapiens (Human)
Description:
Stable expression of human CCK-2 receptors in HEK 293 cells.
Residue:
447
  
Inhibitor
Name:
BDBM50004477
Synonyms:
CCK7 analogue N-(1-Carbamoyl-2-phenyl-ethyl)-3-({2-[3-(1H-indol-3-yl)-2-(2-{2-[3-(4-sulfonyl-oxy-phenyl)-propionylamino]-hexanoylamino}-acetylamino)-propionylamino]-hexanoyl}-methyl-amino)-succinamic acid
Type:
Small organic molecule
Emp. Form.:
C48H62N8O13S
Mol. Mass.:
991.117
SMILES:
CCCC[C@H](NC(=O)CCc1ccc(OS(O)(=O)=O)cc1)C(=O)NCC(=O)N[C@@H](Cc1c[nH]c2ccccc12)C(=O)N[C@@H](CCCC)C(=O)N(C)[C@@H](CC(O)=O)C(=O)N[C@@H](Cc1ccccc1)C(N)=O
: