Target
Phospholipase A2, major isoenzyme
Ligand
BDBM50004502
Substrate
Meas. Tech.
ChEMBL_156343 (CHEMBL759986)
IC50
2600±n/a nM
Citation
 Bennion, CConnolly, SGensmantel, NPHallam, CJackson, CGPrimrose, WURoberts, GCRobinson, DHSlaich, PK Design and synthesis of some substrate analogue inhibitors of phospholipase A2 and investigations by NMR and molecular modeling into the binding interactions in the enzyme-inhibitor complex. J Med Chem 35:2939-51 (1992)  
Target
Name:
Phospholipase A2, major isoenzyme
Synonyms:
Group IB phospholipase A2 PLA2G1B Phospholipase A2
Type:
Hydrolase; monomer or homodimer
Mol. Mass.:
16279.83
Organism:
Sus scrofa (pig)
Description:
Purchased from Sigma.
Residue:
146
  
Inhibitor
Name:
BDBM50004502
Synonyms:
CHEMBL101972 | Phosphoric acid 2-hexadecanoylamino-4-methyl-pentyl ester 2-hydroxy-ethyl ester
Type:
Small organic molecule
Emp. Form.:
C24H50NO6P
Mol. Mass.:
479.6307
SMILES:
CCCCCCCCCCCCCCCC(=O)N[C@@H](COP(O)(=O)OCCO)CC(C)C
: