Target
Neuronal acetylcholine receptor subunit alpha-4/beta-2
Ligand
BDBM50246826
Substrate
Meas. Tech.
ChEMBL_1676974 (CHEMBL4027117)
IC50
10.0±n/a nM
Citation
 Wu, JCippitelli, AZhang, YDebevec, GSchoch, JOzawa, AYu, YLiu, HChen, WHoughten, RAWelmaker, GSGiulianotti, MAToll, L Highly Selective and Potent?4?2 nAChR Antagonist Inhibits Nicotine Self-Administration and Reinstatement in Rats. J Med Chem 60:10092-10104 (2017)  
Target
Name:
Neuronal acetylcholine receptor subunit alpha-4/beta-2
Synonyms:
Neuronal acetylcholine receptor alpha4/beta2 Neuronal acetylcholine receptor; alpha4/beta2
Type:
Mol. Mass.:
Description:
Components:
This complex has 0 components.
Component 1
Name:
Neuronal acetylcholine receptor subunit alpha-4
Synonyms:
ACHA4_RAT Cholinergic, Nicotinic Alpha4Beta2 Chrna4 Neuronal acetylcholine receptor (alpha4beta2 nAChR) Neuronal acetylcholine receptor subunit alpha 4 beta 2 | Neuronal acetylcholine receptor subunit alpha-4
Type:
Enzyme
Mol. Mass.:
70196.44
Organism:
Rattus norvegicus (Rat)
Description:
P09483
Residue:
630
  
Component 2
Name:
Neuronal acetylcholine receptor subunit beta-2
Synonyms:
ACHB2_RAT Chrnb2 Neuronal acetylcholine receptor non-alpha-1 chain
Type:
Enzyme
Mol. Mass.:
56910.32
Organism:
Rattus norvegicus (Rat)
Description:
P12390
Residue:
500
  
Inhibitor
Name:
BDBM50246826
Synonyms:
CHEMBL4084577
Type:
Small organic molecule
Emp. Form.:
C11H16N4
Mol. Mass.:
204.2715
SMILES:
C[C@H]1CNC(=N)N1CCc1cccnc1
: