Target
Carbonic anhydrase 2
Ligand
BDBM50004550
Substrate
Meas. Tech.
ChEMBL_45061 (CHEMBL658057)
Ki
19±n/a nM
Citation
 Hartman, GDHalczenko, WPrugh, JDSmith, RLSugrue, MFMallorga, PMichelson, SRRandall, WCSchwam, HSondey, JM Thieno[2,3-b]furan-2-sulfonamides as topical carbonic anhydrase inhibitors. J Med Chem 35:3027-33 (1992)  
Target
Name:
Carbonic anhydrase 2
Synonyms:
CA-II CAC Carbonate dehydratase II Carbonic anhydrase 2 (CA-II) Carbonic anhydrase C Carbonic anhydrase II (CA-II) Carbonic anhydrase II (hCA II) | Carbonic anhydrase isoenzyme II (hCA II)
Type:
Enzyme
Mol. Mass.:
29250.71
Organism:
Homo sapiens (Human)
Description:
P00918
Residue:
260
  
Inhibitor
Name:
BDBM50004550
Synonyms:
5-Ethylaminomethyl-thieno[2,3-b]furan-2-sulfonic acid amide | CHEMBL103621
Type:
Small organic molecule
Emp. Form.:
C9H12N2O3S2
Mol. Mass.:
260.333
SMILES:
CCNCc1cc2cc(oc2s1)S(N)(=O)=O
: