Target
Glutamate receptor ionotropic, NMDA 1/2A
Ligand
BDBM50246910
Substrate
Meas. Tech.
ChEMBL_1677212 (CHEMBL4027355)
Ki
4700±n/a nM
Citation
 Gynther, MProietti Silvestri, IHansen, JCHansen, KBMalm, TIshchenko, YLarsen, YHan, LKayser, SAuriola, SPetsalo, ANielsen, BPickering, DSBunch, L Augmentation of Anticancer Drug Efficacy in Murine Hepatocellular Carcinoma Cells by a Peripherally Acting Competitive N-Methyl-d-aspartate (NMDA) Receptor Antagonist. J Med Chem 60:9885-9904 (2017)  
Target
Name:
Glutamate receptor ionotropic, NMDA 1/2A
Synonyms:
Glutamate NMDA receptor; Grin1/Grin2a | Glutamate [NMDA] receptor subunit epsilon 1/zeta 1
Type:
Mol. Mass.:
Description:
ASSAY_ID of EBI is 141020
Components:
This complex has 2 components.
Component 1
Name:
Glutamate receptor ionotropic, NMDA 2A
Synonyms:
Glutamate NMDA receptor; Grin1/Grin2a Grin2a NMDE1_RAT
Type:
Protein
Mol. Mass.:
165478.25
Organism:
Rattus norvegicus (Rat)
Description:
Q00959
Residue:
1464
  
Component 2
Name:
Glutamate receptor ionotropic, NMDA 1
Synonyms:
Glutamate (NMDA) receptor subunit zeta 1 Glutamate-NMDA-Channel Glutamate-NMDA-Polyamine NMDA Nmdar1 | phencyclidine
Type:
Enzyme Catalytic Domain
Mol. Mass.:
105533.40
Organism:
RAT
Description:
P35439
Residue:
938
  
Inhibitor
Name:
BDBM50246910
Synonyms:
CHEMBL4084540
Type:
Small organic molecule
Emp. Form.:
C12H13Cl2NO4
Mol. Mass.:
306.142
SMILES:
Cl.OC(=O)[C@H]1NCC[C@@H]1c1ccc(Cl)c(c1)C(O)=O
: