Target
Muscarinic acetylcholine receptor M1
Ligand
BDBM50004658
Substrate
Meas. Tech.
ChEBML_138550
IC50
3300±n/a nM
Citation
 Valli, MJTang, YKosh, JWChapman, JMSowell, JW Synthesis and cholinergic properties of N-aryl-2-[[[5-[(dimethylamino)methyl]-2-furanyl]methyl]thio]ethylamino analogs of ranitidine. J Med Chem 35:3141-7 (1992)  
Target
Name:
Muscarinic acetylcholine receptor M1
Synonyms:
ACM1_MOUSE Cholinergic, muscarinic Chrm1 Muscarinic acetylcholine receptor M1
Type:
Enzyme Catalytic Domain
Mol. Mass.:
51400.50
Organism:
Mus musculus
Description:
Cholinergic, muscarinic 0 0::Q52KQ0
Residue:
460
  
Inhibitor
Name:
BDBM50004658
Synonyms:
2-{5-[2-(5-Dimethylaminomethyl-furan-2-ylmethylsulfanyl)-ethylamino]-2,4-dinitro-phenylamino}-benzonitrile | CHEMBL106082
Type:
Small organic molecule
Emp. Form.:
C23H24N6O5S
Mol. Mass.:
496.539
SMILES:
CN(C)Cc1ccc(CSCCNc2cc(Nc3ccccc3C#N)c(cc2[N+]([O-])=O)[N+]([O-])=O)o1
: