Target
Muscarinic acetylcholine receptor M2
Ligand
BDBM50004662
Substrate
Meas. Tech.
ChEMBL_140041 (CHEMBL744021)
IC50
6400±n/a nM
Citation
 Valli, MJTang, YKosh, JWChapman, JMSowell, JW Synthesis and cholinergic properties of N-aryl-2-[[[5-[(dimethylamino)methyl]-2-furanyl]methyl]thio]ethylamino analogs of ranitidine. J Med Chem 35:3141-7 (1992)  
Target
Name:
Muscarinic acetylcholine receptor M2
Synonyms:
ACM2_RAT Chrm-2 | Chrm2
Type:
Enzyme Catalytic Domain
Mol. Mass.:
51555.53
Organism:
RAT
Description:
P10980
Residue:
466
  
Inhibitor
Name:
BDBM50004662
Synonyms:
CHEMBL108163 | N-[2-(5-Dimethylaminomethyl-furan-2-ylmethylsulfanyl)-ethyl]-4,6-dinitro-N'-phenyl-benzene-1,3-diamine
Type:
Small organic molecule
Emp. Form.:
C22H25N5O5S
Mol. Mass.:
471.529
SMILES:
CN(C)Cc1ccc(CSCCNc2cc(Nc3ccccc3)c(cc2[N+]([O-])=O)[N+]([O-])=O)o1
: