Target
Cholinesterase
Ligand
BDBM50004658
Substrate
Meas. Tech.
ChEBML_41586
IC50
1800±n/a nM
Citation
 Valli, MJTang, YKosh, JWChapman, JMSowell, JW Synthesis and cholinergic properties of N-aryl-2-[[[5-[(dimethylamino)methyl]-2-furanyl]methyl]thio]ethylamino analogs of ranitidine. J Med Chem 35:3141-7 (1992)  
Target
Name:
Cholinesterase
Synonyms:
Acylcholine acylhydrolase Butyrylcholine esterase (BChE) Butyrylcholinesterase (BuChE) CHLE_HUMAN Cholinesterases Pseudocholinesterase
Type:
Homotetramer
Mol. Mass.:
68422.27
Organism:
Homo sapiens (Human)
Description:
P06276
Residue:
602
  
Inhibitor
Name:
BDBM50004658
Synonyms:
2-{5-[2-(5-Dimethylaminomethyl-furan-2-ylmethylsulfanyl)-ethylamino]-2,4-dinitro-phenylamino}-benzonitrile | CHEMBL106082
Type:
Small organic molecule
Emp. Form.:
C23H24N6O5S
Mol. Mass.:
496.539
SMILES:
CN(C)Cc1ccc(CSCCNc2cc(Nc3ccccc3C#N)c(cc2[N+]([O-])=O)[N+]([O-])=O)o1
: