Target
Acetylcholinesterase
Ligand
BDBM50004653
Substrate
Meas. Tech.
ChEBML_28294
IC50
520±n/a nM
Citation
 Valli, MJTang, YKosh, JWChapman, JMSowell, JW Synthesis and cholinergic properties of N-aryl-2-[[[5-[(dimethylamino)methyl]-2-furanyl]methyl]thio]ethylamino analogs of ranitidine. J Med Chem 35:3141-7 (1992)  
Target
Name:
Acetylcholinesterase
Synonyms:
ACES_HUMAN Acetylcholinesterase (AChE) | Acetylcholinesterase (human AChE)
Type:
Enzyme
Mol. Mass.:
67792.70
Organism:
Homo sapiens (Human)
Description:
P22303
Residue:
614
  
Inhibitor
Name:
BDBM50004653
Synonyms:
CHEMBL106348 | N-(2-Dimethylamino-ethyl)-N'-[2-(5-dimethylaminomethyl-furan-2-ylmethylsulfanyl)-ethyl]-4,6-dinitro-benzene-1,3-diamine
Type:
Small organic molecule
Emp. Form.:
C20H30N6O5S
Mol. Mass.:
466.554
SMILES:
CN(C)CCNc1cc(NCCSCc2ccc(CN(C)C)o2)c(cc1[N+]([O-])=O)[N+]([O-])=O
: