Target
Muscarinic acetylcholine receptor M2
Ligand
BDBM50004665
Substrate
Meas. Tech.
ChEMBL_139895 (CHEMBL744482)
Ki
1500±n/a nM
Citation
 Valli, MJTang, YKosh, JWChapman, JMSowell, JW Synthesis and cholinergic properties of N-aryl-2-[[[5-[(dimethylamino)methyl]-2-furanyl]methyl]thio]ethylamino analogs of ranitidine. J Med Chem 35:3141-7 (1992)  
Target
Name:
Muscarinic acetylcholine receptor M2
Synonyms:
ACM2_MOUSE Chrm2 | Muscarinic acetylcholine receptor
Type:
PROTEIN
Mol. Mass.:
51515.43
Organism:
Mus musculus
Description:
ChEMBL_139897
Residue:
466
  
Inhibitor
Name:
BDBM50004665
Synonyms:
(oxotremorine)1-(4-Pyrrolidin-1-yl-but-2-ynyl)-pyrrolidin-2-one 1-(4-Pyrrolidin-1-yl-but-2-ynyl)-pyrrolidin-2-one (oxotremorphine) 1-[4-(2-oxo-pyrrolidin-1-yl)-but-2-ynyl]-pyrrolidinium Oxotremorine cid_4630
Type:
Small organic molecule
Emp. Form.:
C12H18N2O
Mol. Mass.:
206.2841
SMILES:
O=C1CCCN1CC#CCN1CCCC1
: