Target
Acetylcholinesterase
Ligand
BDBM50004673
Substrate
Meas. Tech.
ChEBML_28294
IC50
650±n/a nM
Citation
 Valli, MJTang, YKosh, JWChapman, JMSowell, JW Synthesis and cholinergic properties of N-aryl-2-[[[5-[(dimethylamino)methyl]-2-furanyl]methyl]thio]ethylamino analogs of ranitidine. J Med Chem 35:3141-7 (1992)  
Target
Name:
Acetylcholinesterase
Synonyms:
ACES_HUMAN Acetylcholinesterase (AChE) | Acetylcholinesterase (human AChE)
Type:
Enzyme
Mol. Mass.:
67792.70
Organism:
Homo sapiens (Human)
Description:
P22303
Residue:
614
  
Inhibitor
Name:
BDBM50004673
Synonyms:
CHEMBL104355 | [2-(5-Dimethylaminomethyl-furan-2-ylmethylsulfanyl)-ethyl]-(4-fluoro-2-nitro-phenyl)-amine
Type:
Small organic molecule
Emp. Form.:
C16H20FN3O3S
Mol. Mass.:
353.412
SMILES:
CN(C)Cc1ccc(CSCCNc2ccc(F)cc2[N+]([O-])=O)o1
: