Target
Adenosine receptor A1
Ligand
BDBM50455624
Substrate
Meas. Tech.
ChEBML_28536
Ki
6300±n/a nM
Citation
 Peet, NPLentz, NLSunder, SDudley, MWOgden, AM Conformationally restrained, chiral (phenylisopropyl)amino-substituted pyrazolo[3,4-d]pyrimidines and purines with selectivity for adenosine A1 and A2 receptors. J Med Chem 35:3263-9 (1992)  
Target
Name:
Adenosine receptor A1
Synonyms:
AA1R_RAT ADENOSINE A1 high Adenosine A1 receptor (A1) Adenosine receptors A1 | Adora1
Type:
Protein
Mol. Mass.:
36704.13
Organism:
Rattus norvegicus (rat)
Description:
Residue:
326
  
Inhibitor
Name:
BDBM50455624
Synonyms:
CHEMBL2112500
Type:
Small organic molecule
Emp. Form.:
C23H25N5O2
Mol. Mass.:
403.4769
SMILES:
CCCOc1nc(N[C@@H](C)[C@H](O)c2ccccc2)c2cnn(-c3ccccc3)c2n1
: