Target
Muscarinic acetylcholine receptor
Ligand
BDBM50004733
Substrate
Meas. Tech.
ChEMBL_138312 (CHEMBL743823)
Kd
2900±n/a nM
Citation
 Nilsson, BMVargas, HMHacksell, U Urea and 2-imidazolidone derivatives of the muscarinic agents oxotremorine and N-methyl-N-(1-methyl-4-pyrrolidino-2-butynyl)acetamide. J Med Chem 35:3270-9 (1992)  
Target
Name:
Muscarinic acetylcholine receptor
Synonyms:
GPM3 | Muscarinic acetylcholine receptor M3
Type:
Mol. Mass.:
66272.13
Organism:
Cavia porcellus
Description:
Residue:
587
  
Inhibitor
Name:
BDBM50004733
Synonyms:
1-Methyl-3-(4-pyrrolidin-1-yl-but-2-ynyl)-imidazolidin-2-one | CHEMBL77079
Type:
Small organic molecule
Emp. Form.:
C12H19N3O
Mol. Mass.:
221.2988
SMILES:
CN1CCN(CC#CCN2CCCC2)C1=O
: