Target
D(2) dopamine receptor
Ligand
BDBM50004815
Substrate
Meas. Tech.
ChEMBL_63063 (CHEMBL673630)
Ki
0.063000±n/a nM
Citation
 Mach, RHJackson, JRLuedtke, RRIvins, KJMolinoff, PBEhrenkaufer, RL Effect of N-alkylation on the affinities of analogues of spiperone for dopamine D2 and serotonin 5-HT2 receptors. J Med Chem 35:423-30 (1992)  
Target
Name:
D(2) dopamine receptor
Synonyms:
DOPAMINE D2 DOPAMINE D2 Short Dopamine D2 receptor Drd2
Type:
G Protein-Coupled Receptor (GPCR)
Mol. Mass.:
50931.60
Organism:
Rattus norvegicus (rat)
Description:
P61169
Residue:
444
  
Inhibitor
Name:
BDBM50004815
Synonyms:
8-[4-(4-Fluoro-phenyl)-4-oxo-butyl]-3-(3-methyl-butyl)-1-phenyl-1,3,8-triaza-spiro[4.5]decan-4-one | CHEMBL344399
Type:
Small organic molecule
Emp. Form.:
C28H36FN3O2
Mol. Mass.:
465.6027
SMILES:
CC(C)CCN1CN(c2ccccc2)C2(CCN(CCCC(=O)c3ccc(F)cc3)CC2)C1=O
: