Target
Serotonin 2 (5-HT2) receptor
Ligand
BDBM50004808
Substrate
Meas. Tech.
ChEMBL_2409 (CHEMBL617687)
Ki
3.2±n/a nM
Citation
 Mach, RHJackson, JRLuedtke, RRIvins, KJMolinoff, PBEhrenkaufer, RL Effect of N-alkylation on the affinities of analogues of spiperone for dopamine D2 and serotonin 5-HT2 receptors. J Med Chem 35:423-30 (1992)  
Target
Name:
Serotonin 2 (5-HT2) receptor
Synonyms:
5-hydroxytryptamine receptor 2A/2B/2C
Type:
Mol. Mass.:
Description:
ASSAY_ID of ChEMBL is 2197419
Components:
This complex has 3 components.
Component 1
Name:
5-hydroxytryptamine receptor 2B
Synonyms:
5-HT2B 5HT2B_RAT Serotonin 2b (5-HT2b) receptor Srl
Type:
Enzyme Catalytic Domain
Mol. Mass.:
53668.47
Organism:
RAT
Description:
5-HT2B HTR2B RAT::P30994
Residue:
479
  
Component 2
Name:
5-hydroxytryptamine receptor 2C
Synonyms:
5-HT2C 5-hydroxytryptamine receptor 2C (5HT2c) 5ht1c Htr2c Serotonin receptor 2a and 2c (5HT2A and 5HT2C)
Type:
Enzyme
Mol. Mass.:
51935.10
Organism:
Rattus norvegicus (Rat)
Description:
P08909
Residue:
460
  
Component 3
Name:
5-hydroxytryptamine receptor 2A
Synonyms:
5-HT-2A 5-HT2A 5-hydroxytryptamine receptor 2A (5HT2A) Htr2 Serotonin Receptor 2A
Type:
G Protein-Coupled Receptor (GPCR)
Mol. Mass.:
52852.05
Organism:
Rattus norvegicus (rat)
Description:
Rat cortex membranes 5-HT2A receptors.
Residue:
471
  
Inhibitor
Name:
BDBM50004808
Synonyms:
3-Benzyl-8-[4-(4-fluoro-phenyl)-4-oxo-butyl]-1-phenyl-1,3,8-triaza-spiro[4.5]decan-4-one | CHEMBL134400
Type:
Small organic molecule
Emp. Form.:
C30H32FN3O2
Mol. Mass.:
485.5924
SMILES:
Fc1ccc(cc1)C(=O)CCCN1CCC2(CC1)N(CN(Cc1ccccc1)C2=O)c1ccccc1
: