Target
ATP-binding cassette sub-family C member 4
Ligand
BDBM81984
Substrate
Meas. Tech.
ChEMBL_1678647 (CHEMBL4028924)
IC50
>133000±n/a nM
Citation
 Morgan, REvan Staden, CJChen, YKalyanaraman, NKalanzi, JDunn, RTAfshari, CAHamadeh, HK A multifactorial approach to hepatobiliary transporter assessment enables improved therapeutic compound development. Toxicol Sci 136:216-41 (2013)  
Target
Name:
ATP-binding cassette sub-family C member 4
Synonyms:
ABCC4 MOAT-B MRP/cMOAT-related ABC transporter MRP4_HUMAN Multidrug resistance-associated protein 4
Type:
PROTEIN
Mol. Mass.:
149546.12
Organism:
Homo sapiens (Human)
Description:
ChEMBL_1486828
Residue:
1325
  
Inhibitor
Name:
BDBM81984
Synonyms:
CAS_29110-47-2 NSC_3519
Type:
Small organic molecule
Emp. Form.:
C9H9Cl2N3O
Mol. Mass.:
246.093
SMILES:
NC(=N)NC(=O)Cc1c(Cl)cccc1Cl
: