Target
Bile salt export pump
Ligand
BDBM50103521
Substrate
Meas. Tech.
ChEMBL_1678644 (CHEMBL4028921)
IC50
400±n/a nM
Citation
 Morgan, REvan Staden, CJChen, YKalyanaraman, NKalanzi, JDunn, RTAfshari, CAHamadeh, HK A multifactorial approach to hepatobiliary transporter assessment enables improved therapeutic compound development. Toxicol Sci 136:216-41 (2013)  
Target
Name:
Bile salt export pump
Synonyms:
ABCB11 ATP-binding cassette sub-family B member 11 Bile Salt Export Pump, BSEP Bile salt export pump (BSEP)
Type:
Protein
Mol. Mass.:
146405.49
Organism:
Homo sapiens (Human)
Description:
O95342
Residue:
1321
  
Inhibitor
Name:
BDBM50103521
Synonyms:
Actos Duetact US10188639, Compound h-rac-pio | US11141411, Compound h-rac-pio
Type:
Small organic molecule
Emp. Form.:
C19H20N2O3S
Mol. Mass.:
356.439
SMILES:
CCc1ccc(CCOc2ccc(CC3SC(=O)NC3=O)cc2)nc1
: