Target
ATP-binding cassette sub-family C member 4
Ligand
BDBM23620
Substrate
Meas. Tech.
ChEMBL_1678647 (CHEMBL4028924)
IC50
8300±n/a nM
Citation
 Morgan, REvan Staden, CJChen, YKalyanaraman, NKalanzi, JDunn, RTAfshari, CAHamadeh, HK A multifactorial approach to hepatobiliary transporter assessment enables improved therapeutic compound development. Toxicol Sci 136:216-41 (2013)  
Target
Name:
ATP-binding cassette sub-family C member 4
Synonyms:
ABCC4 MOAT-B MRP/cMOAT-related ABC transporter MRP4_HUMAN Multidrug resistance-associated protein 4
Type:
PROTEIN
Mol. Mass.:
149546.12
Organism:
Homo sapiens (Human)
Description:
ChEMBL_1486828
Residue:
1325
  
Inhibitor
Name:
BDBM23620
Synonyms:
2-({6-[bis(2-hydroxyethyl)amino]-4,8-bis(piperidin-1-yl)pyrimido[5,4-d][1,3]diazin-2-yl}(2-hydroxyethyl)amino)ethan-1-ol Dipyridamine Dipyudamine Persantine cid_3108
Type:
Small organic molecule
Emp. Form.:
C24H40N8O4
Mol. Mass.:
504.6256
SMILES:
OCCN(CCO)c1nc(N2CCCCC2)c2nc(nc(N3CCCCC3)c2n1)N(CCO)CCO
: