Target
ATP-binding cassette sub-family C member 3
Ligand
BDBM50058655
Substrate
Meas. Tech.
ChEMBL_1678646 (CHEMBL4028923)
IC50
>133000±n/a nM
Citation
 Morgan, REvan Staden, CJChen, YKalyanaraman, NKalanzi, JDunn, RTAfshari, CAHamadeh, HK A multifactorial approach to hepatobiliary transporter assessment enables improved therapeutic compound development. Toxicol Sci 136:216-41 (2013)  
Target
Name:
ATP-binding cassette sub-family C member 3
Synonyms:
ABCC3 CMOAT2 MLP2 MRP3 Multi-specific organic anion transporter D | Multidrug resistance-associated protein 3
Type:
PROTEIN
Mol. Mass.:
169352.45
Organism:
Homo sapiens (Human)
Description:
ChEMBL_735421
Residue:
1527
  
Inhibitor
Name:
BDBM50058655
Synonyms:
1,1',1'',1'''-[disulfanediylbis(carbonothioylnitrilo)]tetraethane Antabuse (TN) DISULFIRAM N,N,N',N'-tetraethylthiuram disulfide US11753371, Compound II-2a-(Disulfiram) bis(diethylthiocarbamoyl) disulfide med.21724, Compound 151 tetraethylthiuram disulfide | tetraethylthiuram disulphide
Type:
Small organic molecule
Emp. Form.:
C10H20N2S4
Mol. Mass.:
296.539
SMILES:
CCN(CC)C(=S)SSC(=S)N(CC)CC
: