Target
Glutamate receptor ionotropic, NMDA 1
Ligand
BDBM50005083
Substrate
Meas. Tech.
ChEBML_141849
IC50
1700±n/a nM
Citation
 Leeson, PDCarling, RWMoore, KWMoseley, AMSmith, JDStevenson, GChan, TBaker, RFoster, ACGrimwood, S 4-Amido-2-carboxytetrahydroquinolines. Structure-activity relationships for antagonism at the glycine site of the NMDA receptor. J Med Chem 35:1954-68 (1992)  
Target
Name:
Glutamate receptor ionotropic, NMDA 1
Synonyms:
Glutamate (NMDA) receptor subunit zeta 1 Glutamate-NMDA-Channel Glutamate-NMDA-Polyamine NMDA Nmdar1 | phencyclidine
Type:
Enzyme Catalytic Domain
Mol. Mass.:
105533.40
Organism:
RAT
Description:
P35439
Residue:
938
  
Inhibitor
Name:
BDBM50005083
Synonyms:
4-Benzylcarbamoyl-5,7-dichloro-1,2,3,4-tetrahydro-quinoline-2-carboxylic acid | CHEMBL61740
Type:
Small organic molecule
Emp. Form.:
C18H16Cl2N2O3
Mol. Mass.:
379.237
SMILES:
OC(=O)[C@H]1C[C@H](C(=O)NCc2ccccc2)c2c(Cl)cc(Cl)cc2N1
: