Target
5-hydroxytryptamine receptor 1A
Ligand
BDBM21393
Substrate
Meas. Tech.
ChEMBL_1165 (CHEMBL616110)
Ki
1.4±n/a nM
Citation
 Mokrosz, JLPietrasiewicz, MDuszynska, BCegla, MT Structure-activity relationship studies of central nervous system agents. 5. Effect of the hydrocarbon chain on the affinity of 4-substituted 1-(3-chlorophenyl)piperazines for 5-HT1A receptor site. J Med Chem 35:2369-74 (1992)  
Target
Name:
5-hydroxytryptamine receptor 1A
Synonyms:
5-HT-1A 5-HT1A 5-hydroxytryptamine receptor 1A (5HT1A) 5ht1a Htr1a Serotonin 1a (5-HT1a) receptor/Adrenergic receptor alpha-1 | Serotonin receptor 1A
Type:
G Protein-Coupled Receptor (GPCR)
Mol. Mass.:
46445.29
Organism:
Rattus norvegicus (rat)
Description:
Binding assays were performed using rat hippocampal membranes.
Residue:
422
  
Inhibitor
Name:
BDBM21393
Synonyms:
7-(dipropylamino)-5,6,7,8-tetrahydronaphthalen-1-ol 8-OH-DPAT 8-OH-DPAT,(-) CHEMBL1788118 CHEMBL56 US10562853, Compound 8-OH-DPAT cid_1220
Type:
radiolabeled ligand
Emp. Form.:
C16H25NO
Mol. Mass.:
247.3758
SMILES:
CCCN(CCC)C1CCc2cccc(O)c2C1
: