Target
Platelet-activating factor receptor
Ligand
BDBM50005234
Substrate
Meas. Tech.
ChEBML_164926
IC50
190±n/a nM
Citation
 Carceller, EMerlos, MGiral, MBartrolí, JGarcía-Rafanell, JForn, J 4-substituted 2-alkoxytetrahydrofurans as potent and long-lasting PAF antagonists. J Med Chem 35:676-83 (1992)  
Target
Name:
Platelet-activating factor receptor
Synonyms:
PAF-R PTAFR_CAVPO Platelet-activating factor receptor
Type:
Protein
Mol. Mass.:
39005.63
Organism:
Cavia porcellus
Description:
Residue:
342
  
Inhibitor
Name:
BDBM50005234
Synonyms:
2-({Acetyl-[5-(3-phenyl-propoxy)-tetrahydro-furan-3-ylmethoxycarbonyl]-amino}-methyl)-1-ethyl-pyridinium; iodide | CHEMBL158908
Type:
Small organic molecule
Emp. Form.:
C25H33N2O5
Mol. Mass.:
441.5394
SMILES:
CC[n+]1ccccc1CN(C(C)=O)C(=O)OCC1COC(C1)OCCCc1ccccc1
: