Target
Thymidylate synthase
Ligand
BDBM50005323
Substrate
Meas. Tech.
ChEBML_208947
Ki
140±n/a nM
Citation
 Reich, SHFuhry, MANguyen, DPino, MJWelsh, KMWebber, SJanson, CAJordan, SRMatthews, DASmith, WW Design and synthesis of novel 6,7-imidazotetrahydroquinoline inhibitors of thymidylate synthase using iterative protein crystal structure analysis. J Med Chem 35:847-58 (1992)  
Target
Name:
Thymidylate synthase
Synonyms:
TS Thymidylate Synthase (TS) thyA
Type:
Mol. Mass.:
30487.86
Organism:
Escherichia coli
Description:
Residue:
264
  
Inhibitor
Name:
BDBM50005323
Synonyms:
5-[4-(Piperazine-1-sulfonyl)-benzyl]-5,6,7,8-tetrahydro-1H-imidazo[4,5-g]quinolin-2-ylamine CHEMBL56662
Type:
Small organic molecule
Emp. Form.:
C21H26N6O2S
Mol. Mass.:
426.535
SMILES:
Nc1nc2cc3CCCN(Cc4ccc(cc4)S(=O)(=O)N4CCNCC4)c3cc2[nH]1
: