Target
Cholecystokinin receptor type A
Ligand
BDBM50005466
Substrate
Meas. Tech.
ChEMBL_47648 (CHEMBL657360)
Ki
340±n/a nM
Citation
 van der Bent, ABlommaert, AGMelman, CTIJzerman, APvan Wijngaarden, ISoudijn, W Hybrid cholecystokinin-A antagonists based on molecular modeling of lorglumide and L-364,718. J Med Chem 35:1042-9 (1992)  
Target
Name:
Cholecystokinin receptor type A
Synonyms:
CCKAR_RAT Cholecystokinin peripheral Cholecystokinin receptor type A
Type:
Enzyme Catalytic Domain
Mol. Mass.:
49676.37
Organism:
RAT
Description:
Cholecystokinin central 0 RAT::P30551
Residue:
444
  
Inhibitor
Name:
BDBM50005466
Synonyms:
1H-Indole-2-carboxylic acid (3,3-diphenyl-allyl)-amide | CHEMBL9500
Type:
Small organic molecule
Emp. Form.:
C24H20N2O
Mol. Mass.:
352.4284
SMILES:
O=C(NCC=C(c1ccccc1)c1ccccc1)c1cc2ccccc2[nH]1
: