Target
Receptor-type tyrosine-protein kinase FLT3
Ligand
BDBM50250180
Substrate
Meas. Tech.
ChEMBL_1681209 (CHEMBL4031486)
EC50
<10±n/a nM
Citation
 Wang, ALi, XChen, CWu, HQi, ZHu, CYu, KWu, JLiu, JLiu, XHu, ZWang, WWang, WWang, WWang, LWang, BLiu, QLi, LGe, JRen, TZhang, SXia, RLiu, JLiu, Q Discovery of 1-(4-(4-Amino-3-(4-(2-morpholinoethoxy)phenyl)-1H-pyrazolo[3,4-d]pyrimidin-1-yl)phenyl)-3-(5-(tert-butyl)isoxazol-3-yl)urea (CHMFL-FLT3-213) as a Highly Potent Type II FLT3 Kinase Inhibitor Capable of Overcoming a Variety of FLT3 Kinase Mutants in FLT3-ITD Positive AML. J Med Chem 60:8407-8424 (2017)  
Target
Name:
Receptor-type tyrosine-protein kinase FLT3
Synonyms:
CD135 FL cytokine receptor FLK2 FLT3 Fetal liver kinase-2 Fms-like tyrosine kinase 3 (Flt-3) STK-1 Stem cell tyrosine kinase 1
Type:
Enzyme
Mol. Mass.:
112888.62
Organism:
Homo sapiens (Human)
Description:
P36888
Residue:
993
  
Inhibitor
Name:
BDBM50250180
Synonyms:
CHEMBL4101411
Type:
Small organic molecule
Emp. Form.:
C31H35N9O4
Mol. Mass.:
597.6675
SMILES:
CC(C)(C)c1cc(NC(=O)Nc2ccc(cc2)-n2nc(-c3ccc(OCCN4CCOCC4)cc3)c3c(N)ncnc23)no1
: