Target
Bifunctional purine biosynthesis protein ATIC
Ligand
BDBM50005520
Substrate
Meas. Tech.
ChEBML_28431
IC50
94000±n/a nM
Citation
 Bigham, ECHodson, SJMallory, WRWilson, DDuch, DSSmith, GKFerone, R Synthesis and biological activity of open-chain analogues of 5,6,7,8-tetrahydrofolic acid--potential antitumor agents. J Med Chem 35:1399-410 (1992)  
Target
Name:
Bifunctional purine biosynthesis protein ATIC
Synonyms:
5-aminoimidazole-4-carboxamide ribonucleotide formyltransferase AICAR Tfase ATIC Bifunctional purine biosynthesis protein PURH IMP cyclohydrolase Inosinicase PURH Thymidylate synthase/GAR transformylase/AICAR transformylase
Type:
Protein
Mol. Mass.:
64616.62
Organism:
Homo sapiens (Human)
Description:
P31939
Residue:
592
  
Inhibitor
Name:
BDBM50005520
Synonyms:
(S)-2-{4-[3-(2,4-Diamino-6-oxo-1,6-dihydro-pyrimidin-5-yl)-propylamino]-benzoylamino}-pentanedioic acid CHEMBL13659
Type:
Small organic molecule
Emp. Form.:
C19H24N6O6
Mol. Mass.:
432.4305
SMILES:
Nc1nc(N)c(CCCNc2ccc(cc2)C(=O)N[C@@H](CCC(O)=O)C(O)=O)c(=O)[nH]1
: